BDBM318062 US10301317, Example 18::US9624228, Example 18
SMILES Cc1cc(ccn1)-c1n[nH]c2cc3NC(=O)N(CCc4ccc(F)cc4)Cc3cc12
InChI Key InChIKey=HIMQEZARDBYMOS-UHFFFAOYSA-N
Data  2 IC50
  Tab Delimited (TSV)   2D SDfile   Computed 3D by Vconf -m prep SDfile
Find this compound or compounds like it in BindingDB:
Activity Spreadsheet -- Enzyme Inhibition Constant Data from BindingDB
Found 2 hits for monomerid = 318062
TargetMitogen-activated protein kinase 1(Homo sapiens (Human))
Kura Oncology
US Patent
LigandPNGBDBM318062(US10301317, Example 18 | US9624228, Example 18)
Affinity DataIC50: <50nM. Assay description: The inhibition of ERK activity by the compounds disclosed herein was determined using the Z′-LYTE kinase assay kit (Life Technologies) with a S...
Ligand InfoPC cidPC sid
In DepthDetails US Patent
TargetMitogen-activated protein kinase 1(Homo sapiens (Human))
Kura Oncology
US Patent
LigandPNGBDBM318062(US10301317, Example 18 | US9624228, Example 18)
Affinity DataIC50: <50nM. Assay description: The inhibition of ERK activity by the compounds disclosed herein was determined using the Z′-LYTE kinase assay kit (Life Technologies) with a S...
Ligand InfoPC cidPC sid
In DepthDetails US Patent