BDBM31834 2,4-Bisanilinopyrimidine, 13
SMILES Oc1ccc(Nc2ncc(F)c(Nc3ccc(cc3)C(=O)Nc3ccccc3Cl)n2)cc1
InChI Key InChIKey=CLOQRRBPZHLSQE-UHFFFAOYSA-N
Data  2 IC50
  Tab Delimited (TSV)   2D SDfile   Computed 3D by Vconf -m prep SDfile
Find this compound or compounds like it in BindingDB:
Activity Spreadsheet -- Enzyme Inhibition Constant Data from BindingDB
Found 2 hits for monomerid = 31834
TargetAurora kinase B(Homo sapiens (Human))
Genentech
LigandPNGBDBM31834(2,4-Bisanilinopyrimidine, 13)
Affinity DataIC50:  1.90E+3nMpH: 7.5 T: 2°C. Assay description: Aurora kinase was assayed in ELISA format using a GST fusion of the N-terminus of Histone H3 as substrate. Plates were coated with substrate, and the...
In DepthDetails ArticlePubMed
TargetAurora kinase A(Homo sapiens (Human))
Genentech
LigandPNGBDBM31834(2,4-Bisanilinopyrimidine, 13)
Affinity DataIC50:  10nMpH: 7.5 T: 2°C. Assay description: Aurora kinase was assayed in ELISA format using a GST fusion of the N-terminus of Histone H3 as substrate. Plates were coated with substrate, and the...
In DepthDetails ArticlePubMed