BDBM318481 7-(3,5-Dimethylisoxazol-4-yl)-N-ethyl-4-phenyl-4,5-dihydroimidazo[1,5,4-de][1,4]benzoxazin-2-amine::US10464947, Example 27::US11498926, Example 27::US9624241, Example 27
SMILES CCNc1nc2ccc(-c3c(C)noc3C)c3OCC(c4ccccc4)n1c23
InChI Key InChIKey=JSMVJMRRRDITOL-UHFFFAOYSA-N
Data  6 IC50
  Tab Delimited (TSV)   2D SDfile   Computed 3D by Vconf -m prep SDfile
Find this compound or compounds like it in BindingDB:
Activity Spreadsheet -- Enzyme Inhibition Constant Data from BindingDB
Found 6 hits for monomerid = 318481
TargetBromodomain-containing protein 4 [49-170](Homo sapiens (Human))
Incyte
US Patent
LigandPNGBDBM318481(7-(3,5-Dimethylisoxazol-4-yl)-N-ethyl-4-phenyl-4,5...)
Affinity DataIC50: <100nM. Assay description: BRD4-BD1 and BRD4-BD2 assays were conducted in white 384-well polystyrene plate in a final volume of 20 μL for BD1 and 40 μL for BD2. Inhib...
Ligand InfoPC cidPC sid
In DepthDetails US Patent
TargetBromodomain-containing protein 4 [342-460](Homo sapiens (Human))
Incyte
US Patent
LigandPNGBDBM318481(7-(3,5-Dimethylisoxazol-4-yl)-N-ethyl-4-phenyl-4,5...)
Affinity DataIC50: <100nM. Assay description: BRD4-BD1 and BRD4-BD2 assays were conducted in white 384-well polystyrene plate in a final volume of 20 μL for BD1 and 40 μL for BD2. Inhib...
Ligand InfoPC cidPC sid
In DepthDetails US Patent
TargetBromodomain-containing protein 4 [353-454](Homo sapiens (Human))
Incyte
US Patent
LigandPNGBDBM318481(7-(3,5-Dimethylisoxazol-4-yl)-N-ethyl-4-phenyl-4,5...)
Affinity DataIC50: <100nM. Assay description: Table 12: BRD4-BD1 and BRD4-BD2 assays were conducted in white 384-well polystyrene plate in a final volume of 40 μL for BD1 and 60 μL for ...
Ligand InfoPC cidPC sid
In DepthDetails US Patent
TargetBromodomain-containing protein 4 [342-460](Homo sapiens (Human))
Incyte
US Patent
LigandPNGBDBM318481(7-(3,5-Dimethylisoxazol-4-yl)-N-ethyl-4-phenyl-4,5...)
Affinity DataIC50: <100nM. Assay description: BRD4-BD1 and BRD4-BD2 assays were conducted in white 384-well polystyrene plate in a final volume of 20 μL for BD1 and 40 μL for BD2. Inhib...
Ligand InfoPC cidPC sid
In DepthDetails US Patent
TargetBromodomain-containing protein 4 [58-164](Homo sapiens (Human))
Incyte
US Patent
LigandPNGBDBM318481(7-(3,5-Dimethylisoxazol-4-yl)-N-ethyl-4-phenyl-4,5...)
Affinity DataIC50: <100nM. Assay description: Table 11: BRD4-BD1 and BRD4-BD2 assays were conducted in white 384-well polystyrene plate in a final volume of 20 μL for BD1 and 40 μL for ...
Ligand InfoPC cidPC sid
In DepthDetails US Patent
TargetBromodomain-containing protein 4 [42-168](Homo sapiens (Human))
Incyte Holdings
US Patent
LigandPNGBDBM318481(7-(3,5-Dimethylisoxazol-4-yl)-N-ethyl-4-phenyl-4,5...)
Affinity DataIC50: <100nM. Assay description: BRD4-BD1 and BRD4-BD2 assays were conducted in white 384-well polystyrene plate in a final volume of 20 μL for BD1 and 40 μL for BD2. Inhib...
Ligand InfoPC cidPC sid
In DepthDetails US Patent