BDBM318510 7-(3,5-Dimethylisoxazol-4-yl)-2-oxo-4-phenyl-1,2,4,5-tetrahydroimidazo[1,5,4-de][1,4]benzoxazine-9-carbonitrile::US10464947, Example 42::US9624241, Example 42
SMILES Cc1noc(C)c1-c1cc(C#N)c2[nH]c(=O)n3C(COc1c23)c1ccccc1
InChI Key
Data  4 IC50
  Tab Delimited (TSV)   2D SDfile   Computed 3D by Vconf -m prep SDfile
Find this compound or compounds like it in BindingDB:
Activity Spreadsheet -- Enzyme Inhibition Constant Data from BindingDB
Found 4 hits for monomerid = 318510
TargetBromodomain-containing protein 4 [49-170](Homo sapiens (Human))
Incyte
US Patent
LigandPNGBDBM318510(7-(3,5-Dimethylisoxazol-4-yl)-2-oxo-4-phenyl-1,2,4...)
Affinity DataIC50: <100nM. Assay description: BRD4-BD1 and BRD4-BD2 assays were conducted in white 384-well polystyrene plate in a final volume of 20 μL for BD1 and 40 μL for BD2. Inhib...
Ligand InfoPC cidPC sid
In DepthDetails US Patent
TargetBromodomain-containing protein 4 [342-460](Homo sapiens (Human))
Incyte Holdings
US Patent
LigandPNGBDBM318510(7-(3,5-Dimethylisoxazol-4-yl)-2-oxo-4-phenyl-1,2,4...)
Affinity DataIC50: <100nM. Assay description: BRD4-BD1 and BRD4-BD2 assays were conducted in white 384-well polystyrene plate in a final volume of 40 μL for BD1 and 60 μL for BD2. Inhib...
Ligand InfoPC cidPC sid
In DepthDetails US Patent
TargetBromodomain-containing protein 4 [42-168](Homo sapiens (Human))
Incyte Holdings
US Patent
LigandPNGBDBM318510(7-(3,5-Dimethylisoxazol-4-yl)-2-oxo-4-phenyl-1,2,4...)
Affinity DataIC50: <100nM. Assay description: BRD4-BD1 and BRD4-BD2 assays were conducted in white 384-well polystyrene plate in a final volume of 40 μL for BD1 and 60 μL for BD2. Inhib...
Ligand InfoPC cidPC sid
In DepthDetails US Patent
TargetBromodomain-containing protein 4 [342-460](Homo sapiens (Human))
Incyte Holdings
US Patent
LigandPNGBDBM318510(7-(3,5-Dimethylisoxazol-4-yl)-2-oxo-4-phenyl-1,2,4...)
Affinity DataIC50: <100nM. Assay description: BRD4-BD1 and BRD4-BD2 assays were conducted in white 384-well polystyrene plate in a final volume of 20 μL for BD1 and 40 μL for BD2. Inhib...
Ligand InfoPC cidPC sid
In DepthDetails US Patent