BDBM31868 2,4-Bisanilinopyrimidine, 34
SMILES Cc1ccc(Nc2nc(Nc3ccc(O)cc3)ncc2F)cc1
InChI Key InChIKey=LUWDIZQWANMLNR-UHFFFAOYSA-N
Data  1 IC50
  Tab Delimited (TSV)   2D SDfile   Computed 3D by Vconf -m prep SDfile
Find this compound or compounds like it in BindingDB:
Activity Spreadsheet -- Enzyme Inhibition Constant Data from BindingDB
Found 1 hit for monomerid = 31868
TargetAurora kinase A(Homo sapiens (Human))
Genentech
LigandPNGBDBM31868(2,4-Bisanilinopyrimidine, 34)
Affinity DataIC50:  75nM. Assay description: Aurora kinase was assayed in ELISA format using a GST fusion of the N-terminus of Histone H3 as substrate. Plates were coated with substrate, and the...
In DepthDetails ArticlePubMed