BDBM319555 4-(4-Methyl-1,3-oxazol-2-yl)-1-{[(2S)-5-oxopyrrolidin-2-yl]methoxy}-7-(propan-2-yloxy)isoquinoline-6-carboxamide::US10174000, Example 6
SMILES CC(C)Oc1cc2c(OC[C@@H]3CCC(=O)N3)ncc(-c3nc(C)co3)c2cc1C(N)=O
InChI Key InChIKey=RIMUDYDLGPXLHH-ZDUSSCGKSA-N
Data  2 IC50
  Tab Delimited (TSV)   2D SDfile   Computed 3D by Vconf -m prep SDfile
Find this compound or compounds like it in BindingDB:
Activity Spreadsheet -- Enzyme Inhibition Constant Data from BindingDB
Found 2 hits for monomerid = 319555
TargetInterleukin-1 receptor-associated kinase 4(Homo sapiens (Human))
Pfizer
US Patent
LigandPNGBDBM319555(4-(4-Methyl-1,3-oxazol-2-yl)-1-{[(2S)-5-oxopyrroli...)
Affinity DataIC50:  3nM. Assay description: This is an in vitro assay to measure IRAK4 enzymatic activity utilizing the DELFIA (Dissociation-Enhanced Lanthanide Fluorescent Immunoassay, Perkin-...
Ligand InfoPC cidPC sid
In DepthDetails US Patent
TargetInterleukin-1 receptor-associated kinase 4(Homo sapiens (Human))
Pfizer
US Patent
LigandPNGBDBM319555(4-(4-Methyl-1,3-oxazol-2-yl)-1-{[(2S)-5-oxopyrroli...)
Affinity DataIC50:  227nM. Assay description: This is an in vitro assay to measure IRAK4 enzymatic activity utilizing the DELFIA (Dissociation-Enhanced Lanthanide Fluorescent Immunoassay, Perkin-...
Ligand InfoPC cidPC sid
In DepthDetails US Patent