BDBM320996 4-Amino-7-[(2R,3R,4S,5R)-3,4-dihydroxy-5-[(sulfamoylamino)methyl]tetrahydrofuran-2-yl]-5-[2-(2-fluoro-6-propoxy-phenyl)ethynyl]pyrrolo[2,3-d]pyrimidine::US10174040, Example 60::US9963456, Example 60
SMILES CCCOc1cccc(F)c1C#Cc1cn([C@@H]2O[C@H](CNS(N)(=O)=O)[C@@H](O)[C@H]2O)c2ncnc(N)c12
InChI Key InChIKey=JSAXDUAOMDAEDD-WGQQHEPDSA-N
Data  3 IC50
  Tab Delimited (TSV)   2D SDfile   Computed 3D by Vconf -m prep SDfile
Find this compound or compounds like it in BindingDB:
Activity Spreadsheet -- Enzyme Inhibition Constant Data from BindingDB
Found 3 hits for monomerid = 320996
TargetNEDD8-conjugating enzyme UBE2F(Homo sapiens (Human))
Taiho Pharmaceutical
US Patent
LigandPNGBDBM320996(4-Amino-7-[(2R,3R,4S,5R)-3,4-dihydroxy-5-[(sulfamo...)
Affinity DataIC50:  8.5nM. Assay description: A purified NAE (heterodimer of APPBP1 and UBA3) solution was prepared in the following manner. The human APPBP1 gene (NCBI Reference Sequence number:...
Ligand InfoPC cidPC sid
In DepthDetails US Patent
TargetCarbonic anhydrase 2(Homo sapiens (Human))
Taiho Pharmaceutical
US Patent
LigandPNGBDBM320996(4-Amino-7-[(2R,3R,4S,5R)-3,4-dihydroxy-5-[(sulfamo...)
Affinity DataIC50: >1.00E+3nM. Assay description: The carbonic anhydrase II enzyme activity inhibition was measured by measuring the esterase activity in which carbonic anhydrase II degrades 4-nitrop...
Ligand InfoPC cidPC sid
In DepthDetails US Patent
TargetCarbonic anhydrase 2(Homo sapiens (Human))
Taiho Pharmaceutical
US Patent
LigandPNGBDBM320996(4-Amino-7-[(2R,3R,4S,5R)-3,4-dihydroxy-5-[(sulfamo...)
Affinity DataIC50: >1.00E+3nM. Assay description: The carbonic anhydrase II enzyme activity inhibition was measured by measuring the esterase activity in which carbonic anhydrase II degrades 4-nitrop...
Ligand InfoPC cidPC sid
In DepthDetails US Patent