BDBM321052 US10174040, Example 136::US9963456, Example 136::[(1R,2R,3S,4R)-4-[4-Amino-5-(1-benzylpyrazol-4-yl)pyrrolo[2,3-d]pyrimidin-7-yl]-2,3-dihydroxy-cyclopentyl]methyl sulfamate
SMILES Nc1ncnc2n(cc(-c3cnn(Cc4ccccc4)c3)c12)[C@@H]1C[C@H](COS(N)(=O)=O)[C@@H](O)[C@H]1O
InChI Key InChIKey=ZHRKGBQBEGGVRD-JRJVTICQSA-N
Data  3 IC50
  Tab Delimited (TSV)   2D SDfile   Computed 3D by Vconf -m prep SDfile
Find this compound or compounds like it in BindingDB:
Activity Spreadsheet -- Enzyme Inhibition Constant Data from BindingDB
Found 3 hits for monomerid = 321052
TargetNEDD8-conjugating enzyme UBE2F(Homo sapiens (Human))
Taiho Pharmaceutical
US Patent
LigandPNGBDBM321052(US10174040, Example 136 | US9963456, Example 136 |...)
Affinity DataIC50:  12nM. Assay description: A purified NAE (heterodimer of APPBP1 and UBA3) solution was prepared in the following manner. The human APPBP1 gene (NCBI Reference Sequence number:...
Ligand InfoPC cidPC sid
In DepthDetails US Patent
TargetCarbonic anhydrase 2(Homo sapiens (Human))
Taiho Pharmaceutical
US Patent
LigandPNGBDBM321052(US10174040, Example 136 | US9963456, Example 136 |...)
Affinity DataIC50:  31nM. Assay description: The carbonic anhydrase II enzyme activity inhibition was measured by measuring the esterase activity in which carbonic anhydrase II degrades 4-nitrop...
Ligand InfoPC cidPC sid
In DepthDetails US Patent
TargetCarbonic anhydrase 2(Homo sapiens (Human))
Taiho Pharmaceutical
US Patent
LigandPNGBDBM321052(US10174040, Example 136 | US9963456, Example 136 |...)
Affinity DataIC50:  31nM. Assay description: The carbonic anhydrase II enzyme activity inhibition was measured by measuring the esterase activity in which carbonic anhydrase II degrades 4-nitrop...
Ligand InfoPC cidPC sid
In DepthDetails US Patent