BDBM321063 4-Amino-7-[(2R,3R,4S,5R)-3,4-dihydroxy-5-[(sulfamoylamino)methyl]tetrahydrofuran-2-yl]-5-[3-(2-fluorophenyl)prop-1-ynyl]pyrrolo[2,3-d]pyrimidine::US10174040, Example 36::US9963456, Example 36
SMILES Nc1ncnc2n(cc(C#CCc3ccccc3F)c12)[C@@H]1O[C@H](CNS(N)(=O)=O)[C@@H](O)[C@H]1O
InChI Key InChIKey=SOYXTDSWGFZDRI-WVSUBDOOSA-N
Data  2 IC50
  Tab Delimited (TSV)   2D SDfile   Computed 3D by Vconf -m prep SDfile
Find this compound or compounds like it in BindingDB:
Activity Spreadsheet -- Enzyme Inhibition Constant Data from BindingDB
Found 2 hits for monomerid = 321063
TargetCarbonic anhydrase 2(Homo sapiens (Human))
Taiho Pharmaceutical
US Patent
LigandPNGBDBM321063(4-Amino-7-[(2R,3R,4S,5R)-3,4-dihydroxy-5-[(sulfamo...)
Affinity DataIC50: >1.00E+3nM. Assay description: The carbonic anhydrase II enzyme activity inhibition was measured by measuring the esterase activity in which carbonic anhydrase II degrades 4-nitrop...
Ligand InfoPC cidPC sid
In DepthDetails US Patent
TargetCarbonic anhydrase 2(Homo sapiens (Human))
Taiho Pharmaceutical
US Patent
LigandPNGBDBM321063(4-Amino-7-[(2R,3R,4S,5R)-3,4-dihydroxy-5-[(sulfamo...)
Affinity DataIC50: >1.00E+3nM. Assay description: The carbonic anhydrase II enzyme activity inhibition was measured by measuring the esterase activity in which carbonic anhydrase II degrades 4-nitrop...
Ligand InfoPC cidPC sid
In DepthDetails US Patent