BDBM321659 US10183021, Compound I-319
SMILES Fc1ccccc1Cn1nc(cc1-c1ccon1)-c1ncc(F)c(n1)N1CCC[C@@H](C1)c1ccccc1
InChI Key InChIKey=PUMMQLDHEFBQTK-FQEVSTJZSA-N
Data  1 EC50
  Tab Delimited (TSV)   2D SDfile   Computed 3D by Vconf -m prep SDfile
Find this compound or compounds like it in BindingDB:
Activity Spreadsheet -- Enzyme Inhibition Constant Data from BindingDB
Found 1 hit for monomerid = 321659
TargetGuanylate cyclase soluble subunit alpha-1(Homo sapiens (Human))
Ironwood Pharmaceuticals
US Patent
LigandPNGBDBM321659(US10183021, Compound I-319)
Affinity DataEC50: <100nM. Assay description: Human embryonic kidney cells (HEK293), endogenously expressing soluble guanylate cyclase (sGC), were used to evaluate the activity of test compounds....
Ligand InfoPC cidPC sid
In DepthDetails US Patent