BDBM321660 US10183021, Compound I-412
SMILES C[C@H]1CCCN([C@H]1C(O)=O)c1nc(ncc1F)-c1cc(C)n(Cc2ccccc2F)n1
InChI Key InChIKey=JEBDHUYHFPDUJF-ORAYPTAESA-N
Data  1 EC50
  Tab Delimited (TSV)   2D SDfile   Computed 3D by Vconf -m prep SDfile
Find this compound or compounds like it in BindingDB:
Activity Spreadsheet -- Enzyme Inhibition Constant Data from BindingDB
Found 1 hit for monomerid = 321660
TargetGuanylate cyclase soluble subunit alpha-1(Homo sapiens (Human))
Ironwood Pharmaceuticals
US Patent
LigandPNGBDBM321660(US10183021, Compound I-412)
Affinity DataEC50: >1.00E+3nM. Assay description: Human embryonic kidney cells (HEK293), endogenously expressing soluble guanylate cyclase (sGC), were used to evaluate the activity of test compounds....
Ligand InfoPC cidPC sid
In DepthDetails US Patent