BDBM321664 US10183021, Compound I-164
SMILES Fc1ccccc1Cn1nc(cc1-c1ccon1)-c1nccc(NC(=O)C(F)(F)F)n1
InChI Key InChIKey=UNUPWRVRVRTJLV-UHFFFAOYSA-N
Data  1 EC50
  Tab Delimited (TSV)   2D SDfile   Computed 3D by Vconf -m prep SDfile
Find this compound or compounds like it in BindingDB:
Activity Spreadsheet -- Enzyme Inhibition Constant Data from BindingDB
Found 1 hit for monomerid = 321664
TargetGuanylate cyclase soluble subunit alpha-1(Homo sapiens (Human))
Ironwood Pharmaceuticals
US Patent
LigandPNGBDBM321664(US10183021, Compound I-164)
Affinity DataEC50:  550nM. Assay description: Human embryonic kidney cells (HEK293), endogenously expressing soluble guanylate cyclase (sGC), were used to evaluate the activity of test compounds....
Ligand InfoPC cidPC sid
In DepthDetails US Patent