BDBM322176 US10183931, Example 176::US10696660, Example 176::US11311541, Example 176
SMILES O=C(Nc1cccnc1)c1cccc(c1)-c1nccc(Nc2ccc3[nH]ncc3c2)n1
InChI Key InChIKey=ICGVWDKZPPRJIA-UHFFFAOYSA-N
Data  6 IC50
  Tab Delimited (TSV)   2D SDfile   Computed 3D by Vconf -m prep SDfile
Find this compound or compounds like it in BindingDB:
Activity Spreadsheet -- Enzyme Inhibition Constant Data from BindingDB
Found 6 hits for monomerid = 322176
TargetRho-associated protein kinase 2(Homo sapiens (Human))
Kadmon
US Patent
LigandPNGBDBM322176(US10183931, Example 176 | US10696660, Example 176 ...)
Affinity DataIC50:  13nM. Assay description: Dose response curves for Rho-kinase inhibition were derived from a Millipore immuno-based 96 well plate assay (Millipore catalog number CSA001). Puri...
Ligand InfoPC cidPC sid
In DepthDetails US Patent
TargetRho-associated protein kinase 1(Homo sapiens (Human))
Kadmon
US Patent
LigandPNGBDBM322176(US10183931, Example 176 | US10696660, Example 176 ...)
Affinity DataIC50:  3.50E+3nM. Assay description: Dose response curves for Rho-kinase inhibition were derived from a Millipore immuno-based 96 well plate assay (Millipore catalog number CSA001). Puri...
Ligand InfoPC cidPC sid
In DepthDetails US Patent
TargetRho-associated protein kinase 1(Homo sapiens (Human))
Kadmon
US Patent
LigandPNGBDBM322176(US10183931, Example 176 | US10696660, Example 176 ...)
Affinity DataIC50:  3.50E+3nM. Assay description: Dose response curves for Rho-kinase inhibition were derived from a Invitrogen Z′-LYTE™ Kinase Assay Kit (Invitrogen catalog number PV3793). Pur...
Ligand InfoPC cidPC sid
In DepthDetails US Patent
TargetRho-associated protein kinase 2(Homo sapiens (Human))
Kadmon
US Patent
LigandPNGBDBM322176(US10183931, Example 176 | US10696660, Example 176 ...)
Affinity DataIC50:  3.50E+3nM. Assay description: Purified active ROCK1 and ROCK2 were obtained from Invitrogen (catalog numbers ROCK1, PV3691 and ROCK2, PV3759). The kit components include a coumari...
Ligand InfoPC cidPC sid
In DepthDetails US Patent
TargetRho-associated protein kinase 2(Homo sapiens (Human))
Kadmon
US Patent
LigandPNGBDBM322176(US10183931, Example 176 | US10696660, Example 176 ...)
Affinity DataIC50:  13nM. Assay description: Dose response curves for Rho-kinase inhibition were derived from a Invitrogen Z′-LYTE™ Kinase Assay Kit (Invitrogen catalog number PV3793). Pur...
Ligand InfoPC cidPC sid
In DepthDetails US Patent
TargetRho-associated protein kinase 2(Homo sapiens (Human))
Kadmon
US Patent
LigandPNGBDBM322176(US10183931, Example 176 | US10696660, Example 176 ...)
Affinity DataIC50:  13nM. Assay description: Purified active ROCK1 and ROCK2 were obtained from Invitrogen (catalog numbers ROCK1, PV3691 and ROCK2, PV3759). The kit components include a coumari...
Ligand InfoPC cidPC sid
In DepthDetails US Patent