BDBM322420 US10183937, Example 231::US10202369, Example 231::US10472354, Example 230
SMILES CC(O)C(C)Oc1cc(cc(c1)-c1ncc(C)s1)C(=O)N[C@@H](C)c1ccc(nn1)C(F)(F)F
InChI Key InChIKey=LMHZXBDHIYABCN-HSBZDZAISA-N
Data  6 IC50
  Tab Delimited (TSV)   2D SDfile   Computed 3D by Vconf -m prep SDfile
Find this compound or compounds like it in BindingDB:
Activity Spreadsheet -- Enzyme Inhibition Constant Data from BindingDB
Found 6 hits for monomerid = 322420
TargetP2X purinoceptor 3(Homo sapiens (Human))
Bayer Aktiengesellschaft
US Patent
LigandPNGBDBM322420(US10183937, Example 231 | US10202369, Example 231 ...)
Affinity DataIC50:  6nM. Assay description: A fluorescent imaging plate reader (FLEX/FLIPR station; Molecular Devices) was used to monitor intracellular calcium levels using the calcium-chelati...
Ligand InfoPC cidPC sid
In DepthDetails US Patent
TargetP2X purinoceptor 2(Homo sapiens (Human))
Bayer Aktiengesellschaft
US Patent
LigandPNGBDBM322420(US10183937, Example 231 | US10202369, Example 231 ...)
Affinity DataIC50:  706nM. Assay description: A fluorescent imaging plate reader (FLEX/FLIPR station; Molecular Devices) was used to monitor intracellular calcium levels using the calcium-chelati...
Ligand InfoPC cidPC sid
In DepthDetails US Patent
TargetP2X purinoceptor 2/3(Homo sapiens (Human))
Bayer Aktiengesellschaft
US Patent
LigandPNGBDBM322420(US10183937, Example 231 | US10202369, Example 231 ...)
Affinity DataIC50:  209nM. Assay description: A fluorescent imaging plate reader (FILEX/FLIPR station; Molecular Devices) was used to monitor intracellular calcium levels using the calcium-chelat...
Ligand InfoPC cidPC sid
In DepthDetails US Patent
TargetP2X purinoceptor 2/3(Homo sapiens (Human))
Bayer Aktiengesellschaft
US Patent
LigandPNGBDBM322420(US10183937, Example 231 | US10202369, Example 231 ...)
Affinity DataIC50:  706nM. Assay description: A fluorescent imaging plate reader (FLEX/FLIPR station; Molecular Devices) was used to monitor intracellular calcium levels using the calcium-chelati...
Ligand InfoPC cidPC sid
In DepthDetails US Patent
TargetP2X purinoceptor 3(Homo sapiens (Human))
Bayer Aktiengesellschaft
US Patent
LigandPNGBDBM322420(US10183937, Example 231 | US10202369, Example 231 ...)
Affinity DataIC50:  2nM. Assay description: A fluorescent imaging plate reader (FILEX/FLIPR station; Molecular Devices) was used to monitor intracellular calcium levels using the calcium-chelat...
Ligand InfoPC cidPC sid
In DepthDetails US Patent
TargetP2X purinoceptor 3(Homo sapiens (Human))
Bayer Aktiengesellschaft
US Patent
LigandPNGBDBM322420(US10183937, Example 231 | US10202369, Example 231 ...)
Affinity DataIC50:  6nM. Assay description: A fluorescent imaging plate reader (FLEX/FLIPR station; Molecular Devices) was used to monitor intracellular calcium levels using the calcium-chelati...
Ligand InfoPC cidPC sid
In DepthDetails US Patent