BDBM323128 US9629836, 52
SMILES COCC(=O)N1CCC([C@@H](F)C1)n1c(C)nc2cnc3cc(F)c(cc3c12)-c1ccc(Oc2ncccn2)cc1Cl
InChI Key InChIKey=BQYYPCSULGHPTA-ZZHFZYNASA-N
Data  1 IC50
  Tab Delimited (TSV)   2D SDfile   Computed 3D by Vconf -m prep SDfile
Find this compound or compounds like it in BindingDB:
Activity Spreadsheet -- Enzyme Inhibition Constant Data from BindingDB
Found 1 hit for monomerid = 323128
TargetDual specificity mitogen-activated protein kinase kinase 1 [K97R](Homo sapiens (Human))
Novartis
US Patent
LigandPNGBDBM323128(US9629836, 52)
Affinity DataIC50:  9nM. Assay description: The radioactive filter binding assay is standardized using recombinant human activated BRAF (V599E) kinase (Cat No. 14-557) and kinase dead MEK1 (K97...
Ligand InfoPC cidPC sid
In DepthDetails US Patent