BDBM323138 US10011599, Example 62::US9629836, 62
SMILES COc1cc(Oc2ncccn2)ccc1-c1cc2c3n([C@H]4CCN(CC#N)CC4F)c(C)nc3cnc2cc1F
InChI Key InChIKey=GTKJOUZHAZVXFH-NASUQTAISA-N
Data  2 IC50
  Tab Delimited (TSV)   2D SDfile   Computed 3D by Vconf -m prep SDfile
Find this compound or compounds like it in BindingDB:
Activity Spreadsheet -- Enzyme Inhibition Constant Data from BindingDB
Found 2 hits for monomerid = 323138
TargetDual specificity mitogen-activated protein kinase kinase 1(Homo sapiens (Human))
Novartis
US Patent
LigandPNGBDBM323138(US10011599, Example 62 | US9629836, 62)
Affinity DataIC50:  3.70nM. Assay description: [MEK1 1mM ATP IC50 uM] A BRAF-MEK-ERK cascade assay is used to evaluate the effects of these compounds as inhibitors of the MAP kinase pathway. An en...
Ligand InfoPC cidPC sid
In DepthDetails US Patent
TargetDual specificity mitogen-activated protein kinase kinase 1 [K97R](Homo sapiens (Human))
Novartis
US Patent
LigandPNGBDBM323138(US10011599, Example 62 | US9629836, 62)
Affinity DataIC50:  3.70nM. Assay description: The radioactive filter binding assay is standardized using recombinant human activated BRAF (V599E) kinase (Cat No. 14-557) and kinase dead MEK1 (K97...
Ligand InfoPC cidPC sid
In DepthDetails US Patent