BDBM323730 3-Bromo-4-{[(6-bromo-3-methyl-2-phenylquinolin-4-yl)carbonyl]amino}benzoic acid::US10189788, Example 10
SMILES Cc1c(nc2ccc(Br)cc2c1C(=O)Nc1ccc(cc1Br)C(O)=O)-c1ccccc1
InChI Key InChIKey=URUXKTIIHZFZDE-UHFFFAOYSA-N
Data  1 IC50
  Tab Delimited (TSV)   2D SDfile   Computed 3D by Vconf -m prep SDfile
Find this compound or compounds like it in BindingDB:
Activity Spreadsheet -- Enzyme Inhibition Constant Data from BindingDB
Found 1 hit for monomerid = 323730
TargetProstaglandin F2-alpha receptor(Homo sapiens (Human))
Bayer Pharma Aktiengesellschaft
US Patent
LigandPNGBDBM323730(3-Bromo-4-{[(6-bromo-3-methyl-2-phenylquinolin-4-y...)
Affinity DataIC50:  41nM. Assay description: For the characterization of test substances in respect of FP antagonism, PGF2α-induced calcium flux in FP-expressing CHEM1 cells (Millipore, HTS...
Ligand InfoPC cidPC sid
In DepthDetails US Patent