BDBM324310 1-(tert-butyl)-N-(8- (2-((1- methyl-1H-pyrazol-4- yl)amino)pyrimidin-4- yl)-2-(2,2,2- trifluoroethyl)-2,3,4,5- tetrahydro-1H- benzo[c]azepin-5- yl)-1H- 1,2,3-triazole-4- carboxamide::US10189829, Compound 75::US10227341, Compound 75::US10961237, Compound 75::US11858926, Compound 75
SMILES Cn1cc(Nc2nccc(n2)-c2ccc3C(CCN(CC(F)(F)F)Cc3c2)NC(=O)c2cn(nn2)C(C)(C)C)cn1
InChI Key InChIKey=ARSHLFAGIBAPNW-UHFFFAOYSA-N
Data  4 IC50
  Tab Delimited (TSV)   2D SDfile   Computed 3D by Vconf -m prep SDfile
Find this compound or compounds like it in BindingDB:
Activity Spreadsheet -- Enzyme Inhibition Constant Data from BindingDB
Found 4 hits for monomerid = 324310
TargetTyrosine-protein kinase BTK(Homo sapiens (Human))
Biogen Ma
US Patent
LigandPNGBDBM324310(1-(tert-butyl)-N-(8- (2-((1- methyl-1H-pyrazol-4- ...)
Affinity DataIC50: <1nM. Assay description: The purpose of the BTK in vitro assay is to determine compound potency against BTK through the measurement of IC50. Compound inhibition is measured a...
Ligand InfoPC cidPC sid
In DepthDetails US Patent
TargetTyrosine-protein kinase BTK [14-552](Homo sapiens (Human))
Biogen Ma
US Patent
LigandPNGBDBM324310(1-(tert-butyl)-N-(8- (2-((1- methyl-1H-pyrazol-4- ...)
Affinity DataIC50: <1nM. Assay description: The purpose of the BTK in vitro assay is to determine compound potency against BTK through the measurement of IC50. Compound inhibition is measured a...
Ligand InfoPC cidPC sid
In DepthDetails US Patent
TargetTyrosine-protein kinase BTK(Homo sapiens (Human))
Biogen Ma
US Patent
LigandPNGBDBM324310(1-(tert-butyl)-N-(8- (2-((1- methyl-1H-pyrazol-4- ...)
Affinity DataIC50: <1nM. Assay description: The purpose of the BTK in vitro assay is to determine compound potency against BTK through the measurement of IC50. Compound inhibition is measured a...
Ligand InfoPC cidPC sid
In DepthDetails US Patent
TargetTyrosine-protein kinase BTK(Homo sapiens (Human))
Biogen Ma
US Patent
LigandPNGBDBM324310(1-(tert-butyl)-N-(8- (2-((1- methyl-1H-pyrazol-4- ...)
Affinity DataIC50:  505nM. Assay description: The purpose of the BTK in vitro assay is to determine compound potency against BTK through the measurement of IC50. Compound inhibition is measured a...
Ligand InfoPC cidPC sid
In DepthDetails US Patent