BDBM324425 US10189835, Compound 910
SMILES CN(OC1CCOC1)C(=O)c1n[nH]c2CCN(Cc12)C(=O)Nc1cccc(Cl)c1
InChI Key
Data  2 EC50
  Tab Delimited (TSV)   2D SDfile   Computed 3D by Vconf -m prep SDfile
Find this compound or compounds like it in BindingDB:
Activity Spreadsheet -- Enzyme Inhibition Constant Data from BindingDB
Found 2 hits for monomerid = 324425
TargetCapsid protein(Hepatitis B virus)
Novira Therapeutics
Curated by ChEMBL
LigandPNGBDBM324425(US10189835, Compound 910)
Affinity DataEC50:  300nM. Assay description: Modulation of capsid assembly in HBV infected in human HepG2.2.15 cells assessed as inhibition of viral DNA replication preincubated for 3 days follo...
Ligand InfoPC cidPC sid
In DepthDetails ArticlePubMed
TargetCapsid protein(Hepatitis B virus genotype C subtype ayr (isolate ...)
Novira Therapeutics
US Patent
LigandPNGBDBM324425(US10189835, Compound 910)
Affinity DataEC50: <500nM. Assay description: HBV replication inhibition by the compounds of this invention could be determined in cells infected or transfected with HBV, or cells with stably int...
Ligand InfoPC cidPC sid
In DepthDetails US Patent