BDBM325626 US9636336, Example 16::US9636336, Example 73::US9636336, Example 74::[(1S)-2-(3,5-dichloro-1-oxido-pyridin-1-ium-4-yl)-1-(3,4-dimethoxyphenyl)ethyl]5-[[[2-[[(2S)-1-methylpyrrolidin-2-yl]methoxy]-2-oxo-1-phenyl-ethyl]amino]-methyl]thiophene-2-carboxylate
SMILES COc1ccc(cc1OC)[C@H](Cc1c(Cl)c[n+]([O-])cc1Cl)OC(=O)c1ccc(CNC(C(=O)OC[C@@H]2CCCN2C)c2ccccc2)s1
InChI Key InChIKey=OMGJRZSUYADWBN-NITICBCQSA-N
Data  6 IC50
  Tab Delimited (TSV)   2D SDfile   Computed 3D by Vconf -m prep SDfile
Find this compound or compounds like it in BindingDB:
Activity Spreadsheet -- Enzyme Inhibition Constant Data from BindingDB
Found 6 hits for monomerid = 325626
TargetMuscarinic acetylcholine receptor M3(Homo sapiens (Human))
Chiesi Farmaceutici
US Patent
LigandPNGBDBM325626(US9636336, Example 16 | US9636336, Example 73 | US...)
Affinity DataIC50:  5.5nM. Assay description: Human M3 receptor membranes (15 μg/well) from Perkin Elmer are incubated with 0.52 nM Scopolamine Methyl Chloride, [N-methyl-3H] with or without...
Ligand InfoPC cidPC sid
In DepthDetails US Patent
TargetIsoform PDE4B2 of cAMP-specific 3',5'-cyclic phosphodiesterase 4B (PDE4B2)(Homo sapiens (Human))
Chiesi Farmaceutici
US Patent
LigandPNGBDBM325626(US9636336, Example 16 | US9636336, Example 73 | US...)
Affinity DataIC50:  5.5nM. Assay description: PDE4B2 activity is detected using the LANCE Ultra cAMP homogeneous time resolved fluorescence resonance energy transfer (TR-FRET) assay from Perkin E...
Ligand InfoPC cidPC sid
In DepthDetails US Patent
TargetIsoform PDE4B2 of cAMP-specific 3',5'-cyclic phosphodiesterase 4B (PDE4B2)(Homo sapiens (Human))
Chiesi Farmaceutici
US Patent
LigandPNGBDBM325626(US9636336, Example 16 | US9636336, Example 73 | US...)
Affinity DataIC50:  5.5nM. Assay description: PDE4B2 activity is detected using the LANCE Ultra cAMP homogeneous time resolved fluorescence resonance energy transfer (TR-FRET) assay from Perkin E...
Ligand InfoPC cidPC sid
In DepthDetails US Patent
TargetIsoform PDE4B2 of cAMP-specific 3',5'-cyclic phosphodiesterase 4B (PDE4B2)(Homo sapiens (Human))
Chiesi Farmaceutici
US Patent
LigandPNGBDBM325626(US9636336, Example 16 | US9636336, Example 73 | US...)
Affinity DataIC50:  5.5nM. Assay description: PDE4B2 activity is detected using the LANCE Ultra cAMP homogeneous time resolved fluorescence resonance energy transfer (TR-FRET) assay from Perkin E...
Ligand InfoPC cidPC sid
In DepthDetails US Patent
TargetMuscarinic acetylcholine receptor M3(Homo sapiens (Human))
Chiesi Farmaceutici
US Patent
LigandPNGBDBM325626(US9636336, Example 16 | US9636336, Example 73 | US...)
Affinity DataIC50: <1nM. Assay description: Human M3 receptor membranes (15 μg/well) from Perkin Elmer are incubated with 0.52 nM Scopolamine Methyl Chloride, [N-methyl-3H] with or without...
Ligand InfoPC cidPC sid
In DepthDetails US Patent
TargetMuscarinic acetylcholine receptor M3(Homo sapiens (Human))
Chiesi Farmaceutici
US Patent
LigandPNGBDBM325626(US9636336, Example 16 | US9636336, Example 73 | US...)
Affinity DataIC50:  55nM. Assay description: Human M3 receptor membranes (15 μg/well) from Perkin Elmer are incubated with 0.52 nM Scopolamine Methyl Chloride, [N-methyl-3H] with or without...
Ligand InfoPC cidPC sid
In DepthDetails US Patent