BDBM325733 (rac)-4-[2-Fluoro-4-(trifluoromethyl)phenyl]-5-isopropyl-6,7-dihydrocyclopenta[c]pyridin-5-ol::US9636338, 7
SMILES CC(C)C1(O)CCc2cncc(c12)-c1ccc(cc1F)C(F)(F)F
InChI Key InChIKey=CMTVGYIJELKEGA-UHFFFAOYSA-N
Data  2 EC50
  Tab Delimited (TSV)   2D SDfile   Computed 3D by Vconf -m prep SDfile
Find this compound or compounds like it in BindingDB:
Activity Spreadsheet -- Enzyme Inhibition Constant Data from BindingDB
Found 2 hits for monomerid = 325733
TargetCytochrome P450 11B2, mitochondrial(Homo sapiens (Human))
Hoffmann-La Roche
US Patent
LigandPNGBDBM325733((rac)-4-[2-Fluoro-4-(trifluoromethyl)phenyl]-5-iso...)
Affinity DataEC50:  740nM. Assay description: The expression plasmids contains the ORF for either human/cyno CYP11B1 or CYP11B2 under the control of a suitable promoter (CMV-promoter) and a suita...
Ligand InfoPC cidPC sid
In DepthDetails US Patent
TargetCytochrome P450 11B1, mitochondrial(Homo sapiens (Human))
Hoffmann-La Roche
US Patent
LigandPNGBDBM325733((rac)-4-[2-Fluoro-4-(trifluoromethyl)phenyl]-5-iso...)
Affinity DataEC50:  1.44E+4nM. Assay description: The expression plasmids contains the ORF for either human/cyno CYP11B1 or CYP11B2 under the control of a suitable promoter (CMV-promoter) and a suita...
Ligand InfoPC cidPC sid
In DepthDetails US Patent