BDBM325786 1-(4-(4-(4-(2-((2,6-difluorobenzyl)oxy)-1,1,1,3,3,3-hexafluoropropan-2-yl)phenyl)-4-((4-fluorophenyl)sulfonyl)piperidine-1-carbonyl)piperazin-1-yl)ethanone::US9637455, 3
SMILES CC(C)(C)OC(=O)N1CCC(CC1)(c1ccc(cc1)C(OCc1c(F)cccc1F)(C(F)(F)F)C(F)(F)F)S(=O)(=O)c1ccc(F)cc1
InChI Key InChIKey=ATWDSVMKVQYHBH-UHFFFAOYSA-N
Data  1 IC50
  Tab Delimited (TSV)   2D SDfile   Computed 3D by Vconf -m prep SDfile
Find this compound or compounds like it in BindingDB:
Activity Spreadsheet -- Enzyme Inhibition Constant Data from BindingDB
Found 1 hit for monomerid = 325786
TargetNuclear receptor ROR-gamma [262-507](Homo sapiens (Human))
Bristol-Myers Squibb
US Patent
LigandPNGBDBM325786(1-(4-(4-(4-(2-((2,6-difluorobenzyl)oxy)-1,1,1,3,3,...)
Affinity DataIC50:  219nM. Assay description: The binding of potential ligands to RORγ is measured by competition with [3H]25-hydroxycholesterol (Perkin Elmer NET674250UC) using a scintillat...
Ligand InfoPC cidPC sid
In DepthDetails US Patent