BDBM325787 1-(4-(4-(2-((2,6-difluorobenzyl)oxy)-1,1,1,3,3,3-hexafluoropropan-2-yl)phenyl)-4-((4-fluorophenyl)sulfonyl)piperidin-1-yl)-2-(tetrahydro-2H-pyran-4-yl)ethanone::US9637455, 4
SMILES Fc1ccc(cc1)S(=O)(=O)C1(CCN(CC1)C(=O)CC1CCOCC1)c1ccc(cc1)C(OCc1c(F)cccc1F)(C(F)(F)F)C(F)(F)F
InChI Key InChIKey=IXXZPORRDATIIK-UHFFFAOYSA-N
Data  1 IC50
  Tab Delimited (TSV)   2D SDfile   Computed 3D by Vconf -m prep SDfile
Find this compound or compounds like it in BindingDB:
Activity Spreadsheet -- Enzyme Inhibition Constant Data from BindingDB
Found 1 hit for monomerid = 325787
TargetNuclear receptor ROR-gamma [262-507](Homo sapiens (Human))
Bristol-Myers Squibb
US Patent
LigandPNGBDBM325787(1-(4-(4-(2-((2,6-difluorobenzyl)oxy)-1,1,1,3,3,3-h...)
Affinity DataIC50:  57nM. Assay description: The binding of potential ligands to RORγ is measured by competition with [3H]25-hydroxycholesterol (Perkin Elmer NET674250UC) using a scintillat...
Ligand InfoPC cidPC sid
In DepthDetails US Patent