BDBM326068 3-[(3R)-1- (cyclobutylcarbonyl) piperidin-3-yl]-1-(4- phenoxyphenyl)-1H- pyrazolo[3,4-c]pyridin-7- amine::US9637486, Example 13
SMILES Nc1nccc2c(nn(-c3ccc(Oc4ccccc4)cc3)c12)[C@@H]1CCCN(C1)C(=O)C1CCC1
InChI Key InChIKey=DANJOLOCGUTFJZ-HXUWFJFHSA-N
Data  1 IC50
  Tab Delimited (TSV)   2D SDfile   Computed 3D by Vconf -m prep SDfile
Find this compound or compounds like it in BindingDB:
Activity Spreadsheet -- Enzyme Inhibition Constant Data from BindingDB
Found 1 hit for monomerid = 326068
TargetTyrosine-protein kinase BTK(Homo sapiens (Human))
Merck Sharp & Dohme
US Patent
LigandPNGBDBM326068(3-[(3R)-1- (cyclobutylcarbonyl) piperidin-3-yl]-1-...)
Affinity DataIC50:  3.5nM. Assay description: In this assay, the potency (IC50) of each compound was determined from an eleven point (1:3 serial dilution; final compound concentration range in as...
Ligand InfoPC cidPC sid
In DepthDetails US Patent