BDBM326206 (2S)-1-{(3R)-3-[7-amino- 1-(4-phenoxyphenyl)-1H- pyrazolo[3,4-c]pyridin-3- yl]piperidin-1-yl}-1- oxopropan-2-ol::US9637486, Example 18
SMILES C[C@H](O)C(=O)N1CCC[C@H](C1)c1nn(-c2ccc(Oc3ccccc3)cc2)c2c(N)nccc12
InChI Key InChIKey=ORVUTGYZYMAZPY-ZWKOTPCHSA-N
Data  1 IC50
  Tab Delimited (TSV)   2D SDfile   Computed 3D by Vconf -m prep SDfile
Find this compound or compounds like it in BindingDB:
Activity Spreadsheet -- Enzyme Inhibition Constant Data from BindingDB
Found 1 hit for monomerid = 326206
TargetTyrosine-protein kinase BTK(Homo sapiens (Human))
Merck Sharp & Dohme
US Patent
LigandPNGBDBM326206((2S)-1-{(3R)-3-[7-amino- 1-(4-phenoxyphenyl)-1H- p...)
Affinity DataIC50:  2.30nM. Assay description: In this assay, the potency (IC50) of each compound was determined from an eleven point (1:3 serial dilution; final compound concentration range in as...
Ligand InfoPC cidPC sid
In DepthDetails US Patent