BDBM327420 N-[2-(benzylthio)-5-cyanophenyl]-1-benzofuran-2-sulfonamide::US9663460, Example 227
SMILES O=S(=O)(Nc1cc(ccc1SCc1ccccc1)C#N)c1cc2ccccc2o1
InChI Key InChIKey=XGXUTQFVFHMWCM-UHFFFAOYSA-N
Data  1 IC50
  Tab Delimited (TSV)   2D SDfile   Computed 3D by Vconf -m prep SDfile
Find this compound or compounds like it in BindingDB:
Activity Spreadsheet -- Enzyme Inhibition Constant Data from BindingDB
Found 1 hit for monomerid = 327420
TargetC-C chemokine receptor type 2(Homo sapiens (Human))
Allergan
US Patent
LigandPNGBDBM327420(N-[2-(benzylthio)-5-cyanophenyl]-1-benzofuran-2-su...)
Affinity DataIC50:  3.84E+3nM. Assay description: HEK-Gqi5 cells stably expressing CCR2 were cultured in (DMEM high glucose, 10% FBS, 1% PSA, 400 μg/ml geneticin and 50 μg/ml hygromycin. Ap...
Ligand InfoPC cidPC sid
In DepthDetails US Patent