BDBM327857 6-tert-butyl-2-[2- (hydroxymethyl)-3-[1- methyl-5-[[5- (morpholine-4- carbonyl)pyridin-2- yl]amino]-6- oxopyridin-3- yl]phenyl]-3,4- dihydro-2,7- naphthyridin-1-one::US9663494, Compound 5
SMILES Cn1cc(cc(Nc2ccc(cn2)C(=O)N2CCOCC2)c1=O)-c1cccc(N2CCc3cc(ncc3C2=O)C(C)(C)C)c1CO
InChI Key InChIKey=AOFGEFVDONTWCK-UHFFFAOYSA-N
Data  1 IC50
  Tab Delimited (TSV)   2D SDfile   Computed 3D by Vconf -m prep SDfile
Find this compound or compounds like it in BindingDB:
Activity Spreadsheet -- Enzyme Inhibition Constant Data from BindingDB
Found 1 hit for monomerid = 327857
TargetTyrosine-protein kinase BTK(Homo sapiens (Human))
Hoffmann-La Roche
US Patent
LigandPNGBDBM327857(6-tert-butyl-2-[2- (hydroxymethyl)-3-[1- methyl-5-...)
Affinity DataIC50:  13.7nM. Assay description: The assay is a capture of radioactive 33P phosphorylated product through filtration. The interactions of BTK, biotinylated SH2 peptide substrate (Src...
Ligand InfoPC cidPC sid
In DepthDetails US Patent