BDBM329042 4-(5-chloro-6-(3-chloro-4- methylphenoxy)-3-pyridinyl)- N-(methylsulfonyl)-3-(3- oxetanyloxy)benzamide::4-(5-chloro-6-(3-chloro-4-methylphenoxy)-3-pyridinyl)-N-(methylsulfonyl)-3-(3-oxetanyloxy)benzamide::US9663508, Example 425
SMILES Cc1ccc(Oc2ncc(cc2Cl)-c2ccc(cc2OC2COC2)C(=O)NS(C)(=O)=O)cc1Cl
InChI Key InChIKey=OVTZXWWOTNNAAD-UHFFFAOYSA-N
Data  1 IC50
  Tab Delimited (TSV)   2D SDfile   Computed 3D by Vconf -m prep SDfile
Find this compound or compounds like it in BindingDB:
Activity Spreadsheet -- Enzyme Inhibition Constant Data from BindingDB
Found 1 hit for monomerid = 329042
TargetSodium channel protein type 9 subunit alpha(Homo sapiens (Human))
Amgen
US Patent
LigandPNGBDBM329042(4-(5-chloro-6-(3-chloro-4- methylphenoxy)-3-pyridi...)
Affinity DataIC50:  32.2nM. Assay description: HEK 293 cells stably transfected with human Nav1.7 were recorded in whole cell voltage clamp mode with the PatchXpress automated electrophysiology sy...
Ligand InfoPC cidPC sid
In DepthDetails US Patent