BDBM329249 4-(5-chloro-6-(2-chloro-5-methylphenoxy)-3-pyridinyl)-2-::4-(5-chloro-6-(2-chloro-5-methylphenoxy)-3-pyridinyl)-2-fluoro-5-methoxy-N-(methylsulfonyl)benzamide::US9663508, Example 752
SMILES COc1cc(C(=O)NS(C)(=O)=O)c(F)cc1-c1cnc(Oc2cc(C)ccc2Cl)c(Cl)c1
InChI Key InChIKey=WEHOAJHNMXTXOB-UHFFFAOYSA-N
Data  1 IC50
  Tab Delimited (TSV)   2D SDfile   Computed 3D by Vconf -m prep SDfile
Find this compound or compounds like it in BindingDB:
Activity Spreadsheet -- Enzyme Inhibition Constant Data from BindingDB
Found 1 hit for monomerid = 329249
TargetSodium channel protein type 9 subunit alpha(Homo sapiens (Human))
Amgen
US Patent
LigandPNGBDBM329249(4-(5-chloro-6-(2-chloro-5-methylphenoxy)-3-pyridin...)
Affinity DataIC50:  42.1nM. Assay description: HEK 293 cells stably transfected with human Nav1.7 were recorded in whole cell voltage clamp mode with the PatchXpress automated electrophysiology sy...
Ligand InfoPC cidPC sid
In DepthDetails US Patent