BDBM330399 N6-(1-acryloylazetidin-3-yl)-N4-(3-chloro-4-fluorophenyl)-7-methoxyquinazoline-4,6-diamine ::US9725439, 1
SMILES COc1cc2ncnc(Nc3ccc(F)c(Cl)c3)c2cc1NC1CN(C1)C(=O)C=C
InChI Key InChIKey=AFTRDMOBKAMKFT-UHFFFAOYSA-N
Data  2 IC50
  Tab Delimited (TSV)   2D SDfile   Computed 3D by Vconf -m prep SDfile
Find this compound or compounds like it in BindingDB:
Activity Spreadsheet -- Enzyme Inhibition Constant Data from BindingDB
Found 2 hits for monomerid = 330399
TargetEpidermal growth factor receptor [T790M,L858R](Homo sapiens (Human))
Chia Tai Tianqing Pharmaceutical Group
US Patent
LigandPNGBDBM330399(N6-(1-acryloylazetidin-3-yl)-N4-(3-chloro-4-fluoro...)
Affinity DataIC50:  0.800nM. Assay description: EGFR, EGFR (T790M, L858R), HER2 kinase were expressed and purified through an insect cell expression system by the Department of Biology, Centaurus B...
Ligand InfoPC cidPC sid
In DepthDetails US Patent
TargetEpidermal growth factor receptor(Homo sapiens (Human))
Chia Tai Tianqing Pharmaceutical Group
US Patent
LigandPNGBDBM330399(N6-(1-acryloylazetidin-3-yl)-N4-(3-chloro-4-fluoro...)
Affinity DataIC50:  0.300nM. Assay description: EGFR, EGFR (T790M, L858R), HER2 kinase were expressed and purified through an insect cell expression system by the Department of Biology, Centaurus B...
Ligand InfoPC cidPC sid
In DepthDetails US Patent