BDBM331839 (S)-7-[4-(2,4-dihydroxybutyl)oxy-2-methoxyphenyl]-8-(5-fluoro-2-methyl-phenoxymethyl)-1,3,3-trimethyl-3,4-dihydro-1H-quinoxalin-2-one::US10189796, Compound 2-1::US10435379, Compound 2-1
SMILES COc1cc(OC[C@@H](O)CCO)ccc1-c1ccc2NC(C)(C)C(=O)N(C)c2c1COc1cc(F)ccc1C
InChI Key InChIKey=FQNFVOSZGVJCJD-FQEVSTJZSA-N
Data  2 IC50
  Tab Delimited (TSV)   2D SDfile   Computed 3D by Vconf -m prep SDfile
Find this compound or compounds like it in BindingDB:
Activity Spreadsheet -- Enzyme Inhibition Constant Data from BindingDB
Found 2 hits for monomerid = 331839
TargetInterleukin-6(Homo sapiens (Human))
Santen Pharmaceutical
US Patent
LigandPNGBDBM331839((S)-7-[4-(2,4-dihydroxybutyl)oxy-2-methoxyphenyl]-...)
Affinity DataIC50:  15nM. Assay description: 1) The subcultured HCE-T was recovered and the cells were seeded at 2.0×104 cells/0.1 mL/well in a 96-well flat bottom culture plate.2) After culturi...
Ligand InfoPC cidPC sid
In DepthDetails US Patent
TargetInterleukin-6(Homo sapiens (Human))
Santen Pharmaceutical
US Patent
LigandPNGBDBM331839((S)-7-[4-(2,4-dihydroxybutyl)oxy-2-methoxyphenyl]-...)
Affinity DataIC50:  15nM. Assay description: o evaluate the action of the present compounds as a GR agonist, IL-6 production inhibitory action in human corneal epithelial cell line after LPS sti...
Ligand InfoPC cidPC sid
In DepthDetails US Patent