BDBM332562 5-chloroindol-2-yl 2-[(4-fluorophenyl)methyl]-2,7-diazaspiro[3.5]non-7-yl ketone::US10196369, Compound C17
SMILES Fc1ccc(CN2CC3(C2)CCN(CC3)C(=O)c2cc3cc(Cl)ccc3[nH]2)cc1
InChI Key InChIKey=XATZNCUNSXGQKY-UHFFFAOYSA-N
Data  1 IC50
  Tab Delimited (TSV)   2D SDfile   Computed 3D by Vconf -m prep SDfile
Find this compound or compounds like it in BindingDB:
Activity Spreadsheet -- Enzyme Inhibition Constant Data from BindingDB
Found 1 hit for monomerid = 332562
TargetG-protein coupled receptor 183(Homo sapiens (Human))
Sanford Burnham Prebys Medical Discovery Institute
US Patent
LigandPNGBDBM332562(5-chloroindol-2-yl 2-[(4-fluorophenyl)methyl]-2,7-...)
Affinity DataIC50: <5nM. Assay description: The test compounds that demonstrated a corrected % activity of >=50% were defined as inhibitors of the reaction. The experimental values were normali...
Ligand InfoPC cidPC sid
In DepthDetails US Patent