BDBM332591 5-bromoindol-2-yl 7-[(4-bromophenyl)carbonyl]-2,7-diazaspiro[3.5]non-2-yl ketone::US10196369, Compound C46
SMILES Brc1ccc(cc1)C(=O)N1CCC2(CN(C2)C(=O)c2cc3cc(Br)ccc3[nH]2)CC1
InChI Key InChIKey=KEYSCJIIPQOZNS-UHFFFAOYSA-N
Data  1 IC50
  Tab Delimited (TSV)   2D SDfile   Computed 3D by Vconf -m prep SDfile
Find this compound or compounds like it in BindingDB:
Activity Spreadsheet -- Enzyme Inhibition Constant Data from BindingDB
Found 1 hit for monomerid = 332591
TargetG-protein coupled receptor 183(Homo sapiens (Human))
Sanford Burnham Prebys Medical Discovery Institute
US Patent
LigandPNGBDBM332591(5-bromoindol-2-yl 7-[(4-bromophenyl)carbonyl]-2,7-...)
Affinity DataIC50: <5nM. Assay description: The test compounds that demonstrated a corrected % activity of >=50% were defined as inhibitors of the reaction. The experimental values were normali...
Ligand InfoPC cidPC sid
In DepthDetails US Patent