BDBM333461 US9737525, Compound MIND4-23
SMILES COc1ccc(CSc2nnc(COc3cccc4ccccc34)n2Cc2ccccc2)cc1
InChI Key InChIKey=ANOCUNNDQFDBLX-UHFFFAOYSA-N
Data  1 IC50
  Tab Delimited (TSV)   2D SDfile   Computed 3D by Vconf -m prep SDfile
Find this compound or compounds like it in BindingDB:
Activity Spreadsheet -- Enzyme Inhibition Constant Data from BindingDB
Found 1 hit for monomerid = 333461
TargetNAD-dependent protein deacetylase sirtuin-2(Homo sapiens (Human))
The General Hospital
US Patent
LigandPNGBDBM333461(US9737525, Compound MIND4-23)
Affinity DataIC50:  9.00E+3nM. Assay description: Modulation of sirtuin activity by compounds was assessed using the Flour de Lys fluorescent biochemical assay in a 96-well format as described (Outei...
Ligand InfoPC cidPC sid
In DepthDetails US Patent