BDBM333464 US9737525, Compound MIND4C
SMILES [O-][N+](=O)c1ccc(Sc2nnc(COc3ccccc3)n2-c2ccccc2)c2cccnc12
InChI Key InChIKey=CAYNCODJBVZVDW-UHFFFAOYSA-N
Data  1 IC50
  Tab Delimited (TSV)   2D SDfile   Computed 3D by Vconf -m prep SDfile
Find this compound or compounds like it in BindingDB:
Activity Spreadsheet -- Enzyme Inhibition Constant Data from BindingDB
Found 1 hit for monomerid = 333464
TargetNAD-dependent protein deacetylase sirtuin-2(Homo sapiens (Human))
The General Hospital
US Patent
LigandPNGBDBM333464(US9737525, Compound MIND4C)
Affinity DataIC50: >2.00E+7nM. Assay description: Modulation of sirtuin activity by compounds was assessed using the Flour de Lys fluorescent biochemical assay in a 96-well format as described (Outei...
In DepthDetails US Patent