BDBM33601 (5-amino-3-pyridin-3-yl-1,2,4-triazol-1-yl)-(2-methoxyphenyl)methanone::(5-azanyl-3-pyridin-3-yl-1,2,4-triazol-1-yl)-(2-methoxyphenyl)methanone::MLS000115582::SMR000092655::[5-amino-3-(3-pyridinyl)-1,2,4-triazol-1-yl]-(2-methoxyphenyl)methanone::[5-amino-3-(3-pyridyl)-1,2,4-triazol-1-yl]-(2-methoxyphenyl)methanone::cid_971668
SMILES COc1ccccc1C(=O)n1nc(nc1N)-c1cccnc1
InChI Key InChIKey=YLUMVCNEFHTQHD-UHFFFAOYSA-N
Data  7 IC50
  Tab Delimited (TSV)   2D SDfile   Computed 3D by Vconf -m prep SDfile
Find this compound or compounds like it in BindingDB:
Activity Spreadsheet -- Enzyme Inhibition Constant Data from BindingDB
Found 3 hits for monomerid = 33601
TargetProthrombin(Homo sapiens (Human))
Pcmd
Curated by PubChem BioAssay
LigandPNGBDBM33601((5-amino-3-pyridin-3-yl-1,2,4-triazol-1-yl)-(2-met...)
Affinity DataIC50:  486nMpH: 7.5 T: 2°C. Assay description: HTS was performed using 217,350 compounds of the MLSCN library individually plated into 10ul 1536 compound plates at a concentration of 2.5 mM each, ...
In DepthDetails PCBioAssay
TargetCoagulation factor XII(Homo sapiens (Human))
Pcmd
Curated by PubChem BioAssay
LigandPNGBDBM33601((5-amino-3-pyridin-3-yl-1,2,4-triazol-1-yl)-(2-met...)
Affinity DataIC50:  503nM. Assay description: Molecular Library Screening Center Network (MLSCN) Penn Center for Molecular Discovery (PCMD) Assay Provider: Scott L. Diamond, University of Pennsy...
In DepthDetails PCBioAssay
TargetKallikrein-5(Homo sapiens (Human))
Pcmd
Curated by PubChem BioAssay
LigandPNGBDBM33601((5-amino-3-pyridin-3-yl-1,2,4-triazol-1-yl)-(2-met...)
Affinity DataIC50:  713nM. Assay description: Molecular Library Screening Center Network (MLSCN) Penn Center for Molecular Discovery (PCMD) Assay Provider: Scott L. Diamond, University of Pennsy...
In DepthDetails PCBioAssay