BDBM336229 US9744172, Compound UNC00000354A
SMILES CNc1ncc2c(nn(CC3CCC(N)CC3)c2n1)-c1ccc(F)cc1
InChI Key InChIKey=XJVLIDWZBROBSM-UHFFFAOYSA-N
Data  1 IC50
  Tab Delimited (TSV)   2D SDfile   Computed 3D by Vconf -m prep SDfile
Find this compound or compounds like it in BindingDB:
Activity Spreadsheet -- Enzyme Inhibition Constant Data from BindingDB
Found 1 hit for monomerid = 336229
TargetTyrosine-protein kinase Mer(Homo sapiens (Human))
University of North Carolina At Chapel Hill
US Patent
LigandPNGBDBM336229(US9744172, Compound UNC00000354A)
Affinity DataIC50:  55nM. Assay description: The ectopic expression of Mer receptor tyrosine kinase (Mer) has been identified as a tumor cell survival gene product in Acute Lymphoblastic Leukemi...
Ligand InfoPC cidPC sid
In DepthDetails US Patent