BDBM336266 US9744172, Compound UNC586A
SMILES N[C@H]1CCC(Cn2nc(-c3ccc(nc3)N3CCNCC3)c3cnc(NCCCc4ccccc4)nc23)CC1
InChI Key InChIKey=DNXCFFPPWFGXKA-KQVBHHAISA-N
Data  1 IC50
  Tab Delimited (TSV)   2D SDfile   Computed 3D by Vconf -m prep SDfile
Find this compound or compounds like it in BindingDB:
Activity Spreadsheet -- Enzyme Inhibition Constant Data from BindingDB
Found 1 hit for monomerid = 336266
TargetTyrosine-protein kinase Mer(Homo sapiens (Human))
University of North Carolina At Chapel Hill
US Patent
LigandPNGBDBM336266(US9744172, Compound UNC586A)
Affinity DataIC50: <10nM. Assay description: The ectopic expression of Mer receptor tyrosine kinase (Mer) has been identified as a tumor cell survival gene product in Acute Lymphoblastic Leukemi...
Ligand InfoPC cidPC sid
In DepthDetails US Patent