BDBM337276 2-[2-(3,5-dimethoxyphenyl)ethyl]-6-[4-(piperidin-1-ylmethyl)phenyl]-5H-pyrrolo[2,3-b]pyrazine::US9745311, Example 11
SMILES COc1cc(CCc2cnc3[nH]c(cc3n2)-c2ccc(CN3CCCCC3)cc2)cc(OC)c1
InChI Key InChIKey=ADXYVNDMEHCSRQ-UHFFFAOYSA-N
Data  3 IC50
  Tab Delimited (TSV)   2D SDfile   Computed 3D by Vconf -m prep SDfile
Find this compound or compounds like it in BindingDB:
Activity Spreadsheet -- Enzyme Inhibition Constant Data from BindingDB
Found 3 hits for monomerid = 337276
TargetFibroblast growth factor receptor 1(Homo sapiens (Human))
Incyte
US Patent
LigandPNGBDBM337276(2-[2-(3,5-dimethoxyphenyl)ethyl]-6-[4-(piperidin-1...)
Affinity DataIC50: <100nM. Assay description: The inhibitor potency of compounds was measured in an enzyme assay that measures peptide phosphorylation using FRET measurements to detect product fo...
Ligand InfoPC cidPC sid
In DepthDetails US Patent
TargetFibroblast growth factor receptor 3(Homo sapiens (Human))
Incyte
US Patent
LigandPNGBDBM337276(2-[2-(3,5-dimethoxyphenyl)ethyl]-6-[4-(piperidin-1...)
Affinity DataIC50: <100nM. Assay description: The inhibitor potency of compounds was measured in an enzyme assay that measures peptide phosphorylation using FRET measurements to detect product fo...
Ligand InfoPC cidPC sid
In DepthDetails US Patent
TargetFibroblast growth factor receptor 2(Homo sapiens (Human))
Incyte
US Patent
LigandPNGBDBM337276(2-[2-(3,5-dimethoxyphenyl)ethyl]-6-[4-(piperidin-1...)
Affinity DataIC50: <100nM. Assay description: The inhibitor potency of compounds was measured in an enzyme assay that measures peptide phosphorylation using FRET measurements to detect product fo...
Ligand InfoPC cidPC sid
In DepthDetails US Patent