BDBM337642 6-(Ethyl(methyl)amino)-4-hydroxypyridazin-3(2H)-one::US9750748, 12
SMILES CCN(C)c1cc(O)c(=O)[nH]n1
InChI Key InChIKey=DCJSGIACBCVQMB-UHFFFAOYSA-N
Data  1 IC50
  Tab Delimited (TSV)   2D SDfile   Computed 3D by Vconf -m prep SDfile
Find this compound or compounds like it in BindingDB:
Activity Spreadsheet -- Enzyme Inhibition Constant Data from BindingDB
Found 1 hit for monomerid = 337642
TargetD-amino-acid oxidase(Homo sapiens (Human))
Takeda Pharmaceutical
US Patent
LigandPNGBDBM337642(6-(Ethyl(methyl)amino)-4-hydroxypyridazin-3(2H)-on...)
Affinity DataIC50:  150nM. Assay description: The functional activity of compounds inhibiting the DAAO enzyme was determined by utilizing the co-product of the catalysis of D-Serine, H2O2, which ...
Ligand InfoPC cidPC sid
In DepthDetails US Patent