BDBM337745 Ethyl 1-[3-chloro-4-(2-oxoimidazolidin-1-yl)phenyl]-3-[2-methyl-3-(trifluoromethyl)benzyl]-2,4-dioxo-1,2,3,4-tetrahydropyrimidine-5-carboxylate::US9751843, 122
SMILES CCOC(=O)c1cn(-c2ccc(N3CCNC3=O)c(Cl)c2)c(=O)n(Cc2cccc(c2C)C(F)(F)F)c1=O
InChI Key InChIKey=POFVJRBOYDLBJS-UHFFFAOYSA-N
Data  1 IC50
  Tab Delimited (TSV)   2D SDfile   Computed 3D by Vconf -m prep SDfile
Find this compound or compounds like it in BindingDB:
Activity Spreadsheet -- Enzyme Inhibition Constant Data from BindingDB
Found 1 hit for monomerid = 337745
TargetChymase(Homo sapiens (Human))
Bayer Pharma Aktiengesellschaft
US Patent
LigandPNGBDBM337745(Ethyl 1-[3-chloro-4-(2-oxoimidazolidin-1-yl)phenyl...)
Affinity DataIC50:  81nM. Assay description: The enzyme source used is recombinant human chymase (expressed in HEK293 cells) or chymase purified from hamsters' tongues. The substrate used fo...
Ligand InfoPC cidPC sid
In DepthDetails US Patent