BDBM337807 (1E,3E)-2-methyl-1-thien-2-ylpent-1-en-3-one oxime::US9751850, 2
SMILES CC\C(=N/O)\C(\C)=C\c1cccs1
InChI Key InChIKey=IBGTZIUMMBHLKD-ZDVGBALWSA-N
Data  1 IC50
  Tab Delimited (TSV)   2D SDfile   Computed 3D by Vconf -m prep SDfile
Find this compound or compounds like it in BindingDB:
Activity Spreadsheet -- Enzyme Inhibition Constant Data from BindingDB
Found 1 hit for monomerid = 337807
TargetTransient receptor potential cation channel subfamily A member 1(Homo sapiens (Human))
Abbvie
US Patent
LigandPNGBDBM337807((1E,3E)-2-methyl-1-thien-2-ylpent-1-en-3-one oxime...)
Affinity DataIC50:  1.10E+4nM. Assay description: Ca2+ influx was measured using a FLIPR calcium assay kit (R8033; Molecular Devices, Sunnyvale, Calif.). The Ca2+ indicator dye was dissolved in Hanks...
Ligand InfoPC cidPC sid
In DepthDetails US Patent