BDBM339165 US10201546, Example 82c
SMILES CC(C)Oc1c(Cl)c2cc(ccc2nc1N1CCC1)[C@@](O)(c1cnnn1C)c1sc(C)nc1C
InChI Key InChIKey=FLJHJQPHZYWUMD-XMMPIXPASA-N
Data  1 IC50  1 Kd
  Tab Delimited (TSV)   2D SDfile   Computed 3D by Vconf -m prep SDfile
Find this compound or compounds like it in BindingDB:
Activity Spreadsheet -- Enzyme Inhibition Constant Data from BindingDB
Found 2 hits for monomerid = 339165
TargetNuclear receptor ROR-gamma(Homo sapiens (Human))
Janssen Pharmaceutica
US Patent
LigandPNGBDBM339165(US10201546, Example 82c)
Affinity DataIC50:  14nM. Assay description: For the RORγt construct used in the ThermoFluorŪ assay, numbering for the nucleotide sequences was based on the reference sequence for human ROR...
Ligand InfoPC cidPC sid
In DepthDetails US Patent
TargetNuclear receptor ROR-gamma(Homo sapiens (Human))
Janssen Pharmaceutica
US Patent
LigandPNGBDBM339165(US10201546, Example 82c)
Affinity DataKd:  2.10nM. Assay description: ThermoFluor is a fluorescence based assay that estimates ligand binding affinities by measuring the effect of a ligand on protein thermal stability (...
Ligand InfoPC cidPC sid
In DepthDetails US Patent