BDBM339279 US10201546, Example 137
SMILES COc1nc2ccc(cc2c(Cl)c1CC(F)(F)F)C(O)(c1cnnn1C)c1cnc(C)n1C
InChI Key InChIKey=PUMXJBBRBFUMQN-UHFFFAOYSA-N
Data  1 IC50  1 Kd
  Tab Delimited (TSV)   2D SDfile   Computed 3D by Vconf -m prep SDfile
Find this compound or compounds like it in BindingDB:
Activity Spreadsheet -- Enzyme Inhibition Constant Data from BindingDB
Found 2 hits for monomerid = 339279
TargetNuclear receptor ROR-gamma(Homo sapiens (Human))
Janssen Pharmaceutica
US Patent
LigandPNGBDBM339279(US10201546, Example 137)
Affinity DataIC50:  11nM. Assay description: A reporter assay was used to test functional activity of RORγt modulatory compounds on transcriptional activation driven by the RORγt LBD. ...
Ligand InfoPC cidPC sid
In DepthDetails US Patent
TargetNuclear receptor ROR-gamma(Homo sapiens (Human))
Janssen Pharmaceutica
US Patent
LigandPNGBDBM339279(US10201546, Example 137)
Affinity DataKd:  1.30nM. Assay description: ThermoFluor is a fluorescence based assay that estimates ligand binding affinities by measuring the effect of a ligand on protein thermal stability (...
Ligand InfoPC cidPC sid
In DepthDetails US Patent