BDBM339345 US10201546, Example 205c
SMILES Cn1cncc1[C@](O)(c1ccnc(c1)C(F)(F)F)c1ccc2nc(C3CC3)c(CN3CCC(CC3)C(F)(F)F)c(Cl)c2c1
InChI Key InChIKey=RRJUWNGCPKSXSF-MUUNZHRXSA-N
Data  1 IC50  1 Kd
  Tab Delimited (TSV)   2D SDfile   Computed 3D by Vconf -m prep SDfile
Find this compound or compounds like it in BindingDB:
Activity Spreadsheet -- Enzyme Inhibition Constant Data from BindingDB
Found 2 hits for monomerid = 339345
TargetNuclear receptor ROR-gamma(Homo sapiens (Human))
Janssen Pharmaceutica
US Patent
LigandPNGBDBM339345(US10201546, Example 205c)
Affinity DataIC50:  21nM. Assay description: A reporter assay was used to test functional activity of RORγt modulatory compounds on transcriptional activation driven by the RORγt LBD. ...
Ligand InfoPC cidPC sid
In DepthDetails US Patent
TargetNuclear receptor ROR-gamma(Homo sapiens (Human))
Janssen Pharmaceutica
US Patent
LigandPNGBDBM339345(US10201546, Example 205c)
Affinity DataKd:  0.480nM. Assay description: ThermoFluor is a fluorescence based assay that estimates ligand binding affinities by measuring the effect of a ligand on protein thermal stability (...
Ligand InfoPC cidPC sid
In DepthDetails US Patent