BDBM339389 US10201546, Example 227c
SMILES CCc1nc2ccc(cc2c(Cl)c1CC(F)(F)F)[C@](O)(c1cncn1C)c1ccnc(c1)C(F)(F)F
InChI Key InChIKey=KKKRQRXKZQOEFP-HSZRJFAPSA-N
Data  1 IC50  1 Kd
  Tab Delimited (TSV)   2D SDfile   Computed 3D by Vconf -m prep SDfile
Find this compound or compounds like it in BindingDB:
Activity Spreadsheet -- Enzyme Inhibition Constant Data from BindingDB
Found 2 hits for monomerid = 339389
TargetNuclear receptor ROR-gamma(Homo sapiens (Human))
Janssen Pharmaceutica
US Patent
LigandPNGBDBM339389(US10201546, Example 227c)
Affinity DataIC50:  15nM. Assay description: A reporter assay was used to test functional activity of RORγt modulatory compounds on transcriptional activation driven by the RORγt LBD. ...
Ligand InfoPC cidPC sid
In DepthDetails US Patent
TargetNuclear receptor ROR-gamma(Homo sapiens (Human))
Janssen Pharmaceutica
US Patent
LigandPNGBDBM339389(US10201546, Example 227c)
Affinity DataKd:  2.40nM. Assay description: ThermoFluor is a fluorescence based assay that estimates ligand binding affinities by measuring the effect of a ligand on protein thermal stability (...
Ligand InfoPC cidPC sid
In DepthDetails US Patent