BDBM34262 2-[2,5-dimethyl-3-(1,2,4-triazol-4-yliminomethyl)-1-pyrrolyl]-4,5-dimethyl-3-thiophenecarbonitrile::2-[2,5-dimethyl-3-(1,2,4-triazol-4-yliminomethyl)pyrrol-1-yl]-4,5-dimethyl-thiophene-3-carbonitrile::2-[2,5-dimethyl-3-(1,2,4-triazol-4-yliminomethyl)pyrrol-1-yl]-4,5-dimethylthiophene-3-carbonitrile::MLS000037227::SMR000036923::cid_662642
SMILES Cc1cc(C=Nn2cnnc2)c(C)n1-c1sc(C)c(C)c1C#N
InChI Key InChIKey=AQVHLVIDHRPCCN-UHFFFAOYSA-N
Data  1 IC50  3 EC50
  Tab Delimited (TSV)   2D SDfile   Computed 3D by Vconf -m prep SDfile
Find this compound or compounds like it in BindingDB:
Activity Spreadsheet -- Enzyme Inhibition Constant Data from BindingDB
Found 4 hits for monomerid = 34262
TargetGag-Pol polyprotein(Human immunodeficiency virus type 1 group M subtyp...)
University of Pittsburgh
Curated by PubChem BioAssay
LigandPNGBDBM34262(2-[2,5-dimethyl-3-(1,2,4-triazol-4-yliminomethyl)-...)
Affinity DataIC50:  2.22E+3nMpH: 8.0 T: 2°C. Assay description: A fluorescence resonance energy transfer assay is developed in 96-well and 384-well microplate formats with robotic manipulation to enable high-throu...
In DepthDetails PCBioAssay
TargetNuclear receptor coactivator 1(Homo sapiens (Human))
The Scripps Research Institute Molecular Screening Center
Curated by PubChem BioAssay
LigandPNGBDBM34262(2-[2,5-dimethyl-3-(1,2,4-triazol-4-yliminomethyl)-...)
Affinity DataEC50: >7.94E+4nM. Assay description: Source (MLSCN Center Name): The Scripps Research Institute Molecular Screening Center Center Affiliation: The Scripps Research Institute (TSRI) Assay...
In DepthDetails PCBioAssay
TargetNuclear receptor coactivator 2(Homo sapiens (Human))
The Scripps Research Institute Molecular Screening Center
Curated by PubChem BioAssay
LigandPNGBDBM34262(2-[2,5-dimethyl-3-(1,2,4-triazol-4-yliminomethyl)-...)
Affinity DataEC50: >7.94E+4nM. Assay description: Source (MLSCN Center Name): The Scripps Research Institute Molecular Screening Center Center Affiliation: The Scripps Research Institute (TSRI) Assay...
In DepthDetails PCBioAssay
TargetNuclear receptor coactivator 3(Homo sapiens (Human))
The Scripps Research Institute Molecular Screening Center
Curated by PubChem BioAssay
LigandPNGBDBM34262(2-[2,5-dimethyl-3-(1,2,4-triazol-4-yliminomethyl)-...)
Affinity DataEC50: >7.94E+4nM. Assay description: Source (MLSCN Center Name): The Scripps Research Institute Molecular Screening Center http://molscreen.florida.scripps.edu/ Center Affiliation: The ...
In DepthDetails PCBioAssay