BDBM34314 MLS000054793::SMR000060267::bis(1-methyl-2-imidazolyl)-(4-morpholinyl)-sulfanylidenephosphorane::bis(1-methylimidazol-2-yl)-morpholin-4-yl-sulfanylidene--phosphane::bis(1-methylimidazol-2-yl)-morpholino-thioxo-phosphorane::cid_2997661
SMILES Cn1ccnc1P(=S)(N1CCOCC1)c1nccn1C
InChI Key InChIKey=FMTCSBCDWTYTRF-UHFFFAOYSA-N
Data  3 IC50
  Tab Delimited (TSV)   2D SDfile   Computed 3D by Vconf -m prep SDfile
Find this compound or compounds like it in BindingDB:
Activity Spreadsheet -- Enzyme Inhibition Constant Data from BindingDB
Found 3 hits for monomerid = 34314
TargetGag-Pol polyprotein(Human immunodeficiency virus type 1 group M subtyp...)
University of Pittsburgh
Curated by PubChem BioAssay
LigandPNGBDBM34314(MLS000054793 | SMR000060267 | bis(1-methyl-2-imida...)
Affinity DataIC50:  1.18E+4nMpH: 8.0 T: 2°C. Assay description: A fluorescence resonance energy transfer assay is developed in 96-well and 384-well microplate formats with robotic manipulation to enable high-throu...
In DepthDetails PCBioAssay
TargetPolyadenylate-binding protein 1(Homo sapiens (Human))
Burnham Center For Chemical Genomics
Curated by PubChem BioAssay
LigandPNGBDBM34314(MLS000054793 | SMR000060267 | bis(1-methyl-2-imida...)
Affinity DataIC50: >6.60E+4nM. Assay description: Data Source: Sanford-Burnham Center for Chemical Genomics (SBCCG) Source Affiliation: Sanford-Burnham Medical Research Institute (SBMRI, San Diego, C...
In DepthDetails PCBioAssay
TargetPolyadenylate-binding protein 1(Homo sapiens (Human))
Burnham Center For Chemical Genomics
Curated by PubChem BioAssay
LigandPNGBDBM34314(MLS000054793 | SMR000060267 | bis(1-methyl-2-imida...)
Affinity DataIC50: >6.60E+4nM. Assay description: Data Source: Sanford-Burnham Center for Chemical Genomics (SBCCG) Source Affiliation: Sanford-Burnham Medical Research Institute (SBMRI, San Diego, C...
In DepthDetails PCBioAssay