BDBM344370 US10251889, Example 79::US10758542, Example 79::US9782415, Example 79::US9796724, Example 79
SMILES OCc1ncc(F)cc1[C@H]1CCCN1c1ccn2ncc(C(=O)NC3CC3)c2n1
InChI Key InChIKey=JCTABYLGPPBJQB-QGZVFWFLSA-N
Data  8 IC50
  Tab Delimited (TSV)   2D SDfile   Computed 3D by Vconf -m prep SDfile
Find this compound or compounds like it in BindingDB:
Activity Spreadsheet -- Enzyme Inhibition Constant Data from BindingDB
Found 8 hits for monomerid = 344370
TargetHigh affinity nerve growth factor receptor(Homo sapiens (Human))
Array Biopharma
US Patent
LigandPNGBDBM344370(US10251889, Example 79 | US10758542, Example 79 | ...)
Affinity DataIC50:  1.30nM. Assay description: An enzyme-linked immunosorbant assay (ELISA) was used to assess TrkA kinase activity in the presence of inhibitors. Immulon 4HBX 384-well microtiter ...
Ligand InfoPC cidPC sid
In DepthDetails US Patent
TargetTyrosine-protein kinase JAK2(Homo sapiens (Human))
Array Biopharma
US Patent
LigandPNGBDBM344370(US10251889, Example 79 | US10758542, Example 79 | ...)
Affinity DataIC50:  698nM. Assay description: Compounds of Formula I were screened for their ability to inhibit Jak2 using the general enzyme inhibition assay method, in which the assay mixture c...
Ligand InfoPC cidPC sid
In DepthDetails US Patent
TargetTyrosine-protein kinase JAK2(Homo sapiens (Human))
Array Biopharma
US Patent
LigandPNGBDBM344370(US10251889, Example 79 | US10758542, Example 79 | ...)
Affinity DataIC50:  1.30nM. Assay description: Compounds of Formula I were screened for their ability to inhibit Jak2 using the general enzyme inhibition assay method, in which the assay mixture c...
Ligand InfoPC cidPC sid
In DepthDetails US Patent
TargetTyrosine-protein kinase JAK2 [808-1132](Homo sapiens (Human))
Array Biopharma
US Patent
LigandPNGBDBM344370(US10251889, Example 79 | US10758542, Example 79 | ...)
Affinity DataIC50:  698nM. Assay description: Jak2: Compounds of Formula I were screened for their ability to inhibit Jak2 using the general enzyme inhibition assay method, in which the assay mix...
Ligand InfoPC cidPC sid
In DepthDetails US Patent
TargetHigh affinity nerve growth factor receptor(Homo sapiens (Human))
Array Biopharma
US Patent
LigandPNGBDBM344370(US10251889, Example 79 | US10758542, Example 79 | ...)
Affinity DataIC50:  1.30nM. Assay description: Trk enzymatic selectivity was assessed using Omnia™ Kinase Assay reagents from Invitrogen Corp. Enzyme (either TrkA or TrkB from Invitrogen Corp.) an...
Ligand InfoPC cidPC sid
In DepthDetails US Patent
TargetTyrosine-protein kinase JAK2 [808-1132](Homo sapiens (Human))
Array Biopharma
US Patent
LigandPNGBDBM344370(US10251889, Example 79 | US10758542, Example 79 | ...)
Affinity DataIC50:  698nM. Assay description: Compounds of Formula I were screened for their ability to inhibit Jak2 using the general enzyme inhibition assay method, in which the assay mixture c...
Ligand InfoPC cidPC sid
In DepthDetails US Patent
TargetHigh affinity nerve growth factor receptor(Homo sapiens (Human))
Array Biopharma
US Patent
LigandPNGBDBM344370(US10251889, Example 79 | US10758542, Example 79 | ...)
Affinity DataIC50:  1.30nM. Assay description: An enzyme-linked immunosorbant assay (ELISA) was used to assess TrkA kinase activity in the presence of inhibitors. Immulon 4HBX 384-well microtiter ...
Ligand InfoPC cidPC sid
In DepthDetails US Patent
TargetHigh affinity nerve growth factor receptor(Homo sapiens (Human))
Array Biopharma
US Patent
LigandPNGBDBM344370(US10251889, Example 79 | US10758542, Example 79 | ...)
Affinity DataIC50:  698nM. Assay description: An enzyme-linked immunosorbant assay (ELISA) was used to assess TrkA kinase activity in the presence of inhibitors. Immulon 4HBX 384-well microtiter ...
Ligand InfoPC cidPC sid
In DepthDetails US Patent