BDBM344418 US9783500, Compound 13
SMILES CN(C)Cc1cccc(NCc2ccc3ccc(N)nc3c2)c1
InChI Key InChIKey=KLVQNBMBSWDRJZ-UHFFFAOYSA-N
Data  8 KI
PDB links: 4 PDB IDs match this monomer.
  Tab Delimited (TSV)   2D SDfile   Computed 3D by Vconf -m prep SDfile
Find this compound or compounds like it in BindingDB:
Activity Spreadsheet -- Enzyme Inhibition Constant Data from BindingDB
Found 8 hits for monomerid = 344418
TargetNitric oxide synthase, brain(Rattus norvegicus (rat))
Northwestern University
US Patent
LigandPNGBDBM344418(US9783500, Compound 13)
Affinity DataKi:  37nM. Assay description: Rat and human nNOS, murine macrophage iNOS, and human eNOS were recombinant enzymes (expressed in E. coli and purified as reported previously in the ...
Ligand InfoPC cidPC sidPDB
TargetNitric oxide synthase, brain(Homo sapiens (Human))
Northwestern University
US Patent
LigandPNGBDBM344418(US9783500, Compound 13)
Affinity DataKi:  78nM. Assay description: Rat and human nNOS, murine macrophage iNOS, and human eNOS were recombinant enzymes (expressed in E. coli and purified as reported previously in the ...
Ligand InfoPC cidPC sidPDB
TargetNitric oxide synthase, brain(Rattus norvegicus (rat))
Northwestern University
US Patent
LigandPNGBDBM344418(US9783500, Compound 13)
Affinity DataKi:  375nM. Assay description: Inhibition of wild type recombinant rat nNOS expressed in Escherichia coli assessed as nitric oxide production by hemoglobin capture assay
Ligand InfoPC cidPC sidPDB
TargetNitric oxide synthase, brain(Homo sapiens (Human))
Northwestern University
US Patent
LigandPNGBDBM344418(US9783500, Compound 13)
Affinity DataKi:  657nM. Assay description: Inhibition of recombinant human nNOS expressed in Escherichia coli assessed as nitric oxide production by hemoglobin capture assay
Ligand InfoPC cidPC sidPDB
TargetNitric oxide synthase, endothelial(Bos taurus (bovine))
Northwestern University
Curated by ChEMBL
LigandPNGBDBM344418(US9783500, Compound 13)
Affinity DataKi:  1.15E+4nM. Assay description: Inhibition of recombinant bovine eNOS expressed in Escherichia coli assessed as nitric oxide production by hemoglobin capture assay
Ligand InfoPC cidPC sidPDB
TargetNitric oxide synthase, brain(Mus musculus)
Northwestern University
US Patent
LigandPNGBDBM344418(US9783500, Compound 13)
Affinity DataKi:  1.30E+4nM. Assay description: Rat and human nNOS, murine macrophage iNOS, and human eNOS were recombinant enzymes (expressed in E. coli and purified as reported previously in the ...
Ligand InfoPC cidPC sidPDB
TargetNitric oxide synthase, inducible(Homo sapiens (Human))
Northwestern University
US Patent
LigandPNGBDBM344418(US9783500, Compound 13)
Affinity DataKi:  2.10E+4nM. Assay description: Rat and human nNOS, murine macrophage iNOS, and human eNOS were recombinant enzymes (expressed in E. coli and purified as reported previously in the ...
Ligand InfoPC cidPC sidPDB
In DepthDetails US Patent
TargetNitric oxide synthase, inducible(Mus musculus (mouse))
Northwestern University
Curated by ChEMBL
LigandPNGBDBM344418(US9783500, Compound 13)
Affinity DataKi:  3.32E+4nM. Assay description: Inhibition of recombinant murine iNOS expressed in Escherichia coli assessed as nitric oxide production by hemoglobin capture assay
Ligand InfoPC cidPC sidPDB
In DepthDetails ArticlePubMed